Reaction Details
Target3C-like protease
LigandBDBM47874
Substrate/Competitorn/a
Meas. Tech.QFRET-based dose response biochemical high throughput screening assay to identify inhibitors of the SARS coronavirus 3C-like Protease (3CLPro)
IC50 3597±n/a nM
Citation PubChem, PC QFRET-based dose response biochemical high throughput screening assay to identify inhibitors of the SARS coronavirus 3C-like Protease (3CLPro) PubChem Bioassay(2009)[AID]
 
3C-like protease
Name:3C-like protease
Synonyms:n/a
Type:Enzyme Catalytic Domain
Mol. Mass.:33462.05
Organism:Avian infectious bronchitis virus
Description:gi_73745819
Residue:307
BDBM47874
NameBDBM47874
TypeSmall organic molecule
Emp. Form.C19H18N2O4
Mol. Mass.338.3572
SMILESCOc1ccccc1OCCNC(=O)c1cc(=O)[nH]c2ccccc12