Reaction Details
Target3C-like protease
LigandBDBM47918
Substrate/Competitorn/a
Meas. Tech.QFRET-based dose response biochemical high throughput screening assay to identify inhibitors of the SARS coronavirus 3C-like Protease (3CLPro)
IC50 5395±n/a nM
Citation PubChem, PC QFRET-based dose response biochemical high throughput screening assay to identify inhibitors of the SARS coronavirus 3C-like Protease (3CLPro) PubChem Bioassay(2009)[AID]
 
3C-like protease
Name:3C-like protease
Synonyms:n/a
Type:Enzyme Catalytic Domain
Mol. Mass.:33462.05
Organism:Avian infectious bronchitis virus
Description:gi_73745819
Residue:307
BDBM47918
NameBDBM47918
TypeSmall organic molecule
Emp. Form.C20H18ClNO5
Mol. Mass.387.814
SMILESCC1CCc2c(O)n(c(O)c2C1)-c1cc(Cl)ccc1OC(=O)c1ccco1