Reaction Details
TargetDual specificity protein phosphatase 3
LigandBDBM31755
Substrate/Competitorn/a
Meas. Tech.SAR VHR1 Fluorescent Assay for In Vitro dose response studies
IC50 7060±n/a nM
Citation PubChem, PC SAR VHR1 Fluorescent Assay for In Vitro dose response studies PubChem Bioassay(2009)[AID]
 
Dual specificity protein phosphatase 3
Name:Dual specificity protein phosphatase 3
Type:Hydrolase
Mol. Mass.:20480.58
Organism:Homo sapiens (Human)
Description:n/a
Residue:185
BDBM31755
NameBDBM31755
Synonyms:3-(benzylthio)-5,6-bis(2-furyl)-1,2,4-triazine 5,6-bis(2-furanyl)-3-(phenylmethylthio)-1,2,4-triazine MLS-0029114.0001 | cid_2940938
TypeSmall organic molecule
Emp. Form.C18H13N3O2S
Mol. Mass.335.38
SMILESC(Sc1nnc(-c2ccco2)c(n1)-c1ccco1)c1ccccc1