Reaction Details
TargetDual specificity protein phosphatase 3
LigandBDBM46210
Substrate/Competitorn/a
Meas. Tech.SAR VHR1 Fluorescent Assay for In Vitro dose response studies
IC50>99000±n/a nM
Citation PubChem, PC SAR VHR1 Fluorescent Assay for In Vitro dose response studies PubChem Bioassay(2009)[AID]
 
Dual specificity protein phosphatase 3
Name:Dual specificity protein phosphatase 3
Type:Hydrolase
Mol. Mass.:20480.58
Organism:Homo sapiens (Human)
Description:n/a
Residue:185
BDBM46210
NameBDBM46210
Synonyms:4-(1,3-benzodioxol-5-ylmethyl)-N-(4-sulfamoylphenyl)-1-piperazinecarbothioamide 4-piperonyl-N-(4-sulfamoylphenyl)piperazine-1-carbothioamide cid_1213466
TypeSmall organic molecule
Emp. Form.C19H22N4O4S2
Mol. Mass.434.532
SMILESNS(=O)(=O)c1ccc(NC(=S)N2CCN(Cc3ccc4OCOc4c3)CC2)cc1