Reaction Details
TargetDual specificity protein phosphatase 3
LigandBDBM46203
Substrate/Competitorn/a
Meas. Tech.SAR VHR1 absorbance Assay for In Vitro dose response studies.
IC50 342±n/a nM
Citation PubChem, PC SAR VHR1 absorbance Assay for In Vitro dose response studies. PubChem Bioassay(2009)[AID]
 
Dual specificity protein phosphatase 3
Name:Dual specificity protein phosphatase 3
Type:Hydrolase
Mol. Mass.:20480.58
Organism:Homo sapiens (Human)
Description:n/a
Residue:185
BDBM46203
NameBDBM46203
Synonyms:1-(2,6-dichlorophenyl)-3-(2-phenylethyl)thiourea 1-[2,6-bis(chloranyl)phenyl]-3-(2-phenylethyl)thiourea cid_2826665
TypeSmall organic molecule
Emp. Form.C15H14Cl2N2S
Mol. Mass.325.256
SMILESClc1cccc(Cl)c1NC(=S)NCCc1ccccc1