Reaction Details
TargetDual specificity protein phosphatase 3
LigandBDBM46222
Substrate/Competitorn/a
Meas. Tech.SAR VHR1 absorbance Assay for In Vitro dose response studies.
IC50 1260±n/a nM
Citation PubChem, PC SAR VHR1 absorbance Assay for In Vitro dose response studies. PubChem Bioassay(2009)[AID]
 
Dual specificity protein phosphatase 3
Name:Dual specificity protein phosphatase 3
Type:Hydrolase
Mol. Mass.:20480.58
Organism:Homo sapiens (Human)
Description:n/a
Residue:185
BDBM46222
NameBDBM46222
Synonyms:3-(3-chloranyl-4-methoxy-phenyl)-1-(3-methylbutyl)-1-(1-propan-2-ylpiperidin-4-yl)thiourea 3-(3-chloro-4-methoxyphenyl)-1-(3-methylbutyl)-1-(1-propan-2-yl-4-piperidinyl)thiourea MLS-0330044.0001 | cid_24761488
TypeSmall organic molecule
Emp. Form.C21H34ClN3OS
Mol. Mass.412.032
SMILESCOc1ccc(NC(=S)N(CCC(C)C)C2CCN(CC2)C(C)C)cc1Cl