Reaction Details
TargetEukaryotic translation initiation factor 4 gamma 1
LigandBDBM10515
Substrate/Competitorn/a
Meas. Tech.Dose Response Confirmation for Small Molecule Inhibitors of Eukaryotic Translation Initiation
IC50 16560±n/a nM
Citation PubChem, PC Dose Response Confirmation for Small Molecule Inhibitors of Eukaryotic Translation Initiation PubChem Bioassay(2009)[AID]
 
Eukaryotic translation initiation factor 4 gamma 1
Name:Eukaryotic translation initiation factor 4 gamma 1
Type:Enzyme Catalytic Domain
Mol. Mass.:175455.17
Organism:Homo sapiens (Human)
Description:Q04637
Residue:1599
BDBM10515
NameBDBM10515
Synonyms:5-(1,2-dithiolan-3-yl)pentanoic acid D,L-Lipoic acid cid_864 | lipoic acid (LA)
TypeSmall organic molecule
Emp. Form.C8H14O2S2
Mol. Mass.206.326
SMILESOC(=O)CCCCC1CCSS1