Reaction Details
TargetEukaryotic translation initiation factor 4 gamma 1
LigandBDBM40255
Substrate/Competitorn/a
Meas. Tech.Dose Response Confirmation for Small Molecule Inhibitors of Eukaryotic Translation Initiation
IC50 14365.33142±n/a nM
Citation PubChem, PC Dose Response Confirmation for Small Molecule Inhibitors of Eukaryotic Translation Initiation PubChem Bioassay(2009)[AID]
 
Eukaryotic translation initiation factor 4 gamma 1
Name:Eukaryotic translation initiation factor 4 gamma 1
Type:Enzyme Catalytic Domain
Mol. Mass.:175455.17
Organism:Homo sapiens (Human)
Description:Q04637
Residue:1599
BDBM40255
NameBDBM40255
Synonyms:3-[5-[(E)-[3-[2-(3,4-dimethylanilino)-2-keto-ethyl]-2,4-diketo-thiazolidin-5-ylidene]methyl]-2-furyl]-4-methyl-benzoic acid 3-[5-[(E)-[3-[2-(3,4-dimethylanilino)-2-oxoethyl]-2,4-dioxo-5-thiazolidinylidene]methyl]-2-furanyl]-4-methylbenzoic acid 3-{5-[(3-{2-[(3,4-dimethylphenyl)amino]-2-oxoethyl}-2,4-dioxo-1,3-thiazolidin-5-ylidene)methyl]-2-furyl}-4-methylbenzoic acid SMR000135809 | cid_2286610
TypeSmall organic molecule
Emp. Form.C26H22N2O6S
Mol. Mass.490.528
SMILESCc1ccc(NC(=O)CN2C(=O)S\C(=C\c3ccc(o3)-c3cc(ccc3C)C(O)=O)C2=O)cc1C