Reaction Details
TargetEukaryotic translation initiation factor 4 gamma 1
LigandBDBM48803
Substrate/Competitorn/a
Meas. Tech.Dose Response Confirmation for Small Molecule Inhibitors of Eukaryotic Translation Initiation
IC50 15100±n/a nM
Citation PubChem, PC Dose Response Confirmation for Small Molecule Inhibitors of Eukaryotic Translation Initiation PubChem Bioassay(2009)[AID]
 
Eukaryotic translation initiation factor 4 gamma 1
Name:Eukaryotic translation initiation factor 4 gamma 1
Type:Enzyme Catalytic Domain
Mol. Mass.:175455.17
Organism:Homo sapiens (Human)
Description:Q04637
Residue:1599
BDBM48803
NameBDBM48803
Synonyms:2-chloranyl-5-[5-[(E)-[4-oxidanylidene-3-(phenylmethyl)-2-sulfanylidene-1,3-thiazolidin-5-ylidene]methyl]furan-2-yl]benzoic acid 5-[5-[(E)-(3-benzyl-4-keto-2-thioxo-thiazolidin-5-ylidene)methyl]-2-furyl]-2-chloro-benzoic acid 5-{5-[(3-benzyl-4-oxo-2-thioxo-1,3-thiazolidin-5-ylidene)methyl]-2-furyl}-2-chlorobenzoic acid SMR000298763 | cid_2287238
TypeSmall organic molecule
Emp. Form.C22H14ClNO4S2
Mol. Mass.455.934
SMILESOC(=O)c1cc(ccc1Cl)-c1ccc(\C=C2\SC(=S)N(Cc3ccccc3)C2=O)o1