Reaction Details
TargetEukaryotic translation initiation factor 4 gamma 1
LigandBDBM46226
Substrate/Competitorn/a
Meas. Tech.Dose Response Confirmation for Small Molecule Inhibitors of Eukaryotic Translation Initiation
IC50 50000±n/a nM
Citation PubChem, PC Dose Response Confirmation for Small Molecule Inhibitors of Eukaryotic Translation Initiation PubChem Bioassay(2009)[AID]
 
Eukaryotic translation initiation factor 4 gamma 1
Name:Eukaryotic translation initiation factor 4 gamma 1
Type:Enzyme Catalytic Domain
Mol. Mass.:175455.17
Organism:Homo sapiens (Human)
Description:Q04637
Residue:1599
BDBM46226
NameBDBM46226
Synonyms:MLS-0266887.0001 | cid_2545524
TypeSmall organic molecule
Emp. Form.C25H22N2O8S2
Mol. Mass.542.581
SMILESCCOC(=O)c1sc2nc3c(SCCC(O)=O)cc(cn3c(=O)c2c1C)C(=O)c1cc(OC)ccc1O