Reaction Details
Target6-phosphofructo-2-kinase/fructose-2,6-bisphosphatase 4
LigandBDBM267025
Substrate/Competitorn/a
Meas. Tech.PFKFB4 Assay
IC50 1700±n/a nM
Citation Martinsson, JFaernegardh, KJoensson, MRingom, R Bisarylsulfonamides useful in the treatment of inflammation and cancer US Patent US9718809 Publication Date 8/1/2017
 
6-phosphofructo-2-kinase/fructose-2,6-bisphosphatase 4
Name:6-phosphofructo-2-kinase/fructose-2,6-bisphosphatase 4
Type:Enzyme
Mol. Mass.:54039.68
Organism:Homo sapiens (Human)
Description:Q16877
Residue:469
BDBM267025
NameBDBM267025
Synonyms:4-{[(4-Bromo-2,5-dichlorothiophen-3-yl)sulfonyl]amino}-2-hydroxybenzoic acid | US9718809, 22
TypeSmall organic molecule
Emp. Form.C11H6BrCl2NO5S2
Mol. Mass.447.109
SMILESOC(=O)c1ccc(NS(=O)(=O)c2c(Cl)sc(Cl)c2Br)cc1O