Reaction Details
Target6-phosphofructo-2-kinase/fructose-2,6-bisphosphatase 4
LigandBDBM267030
Substrate/Competitorn/a
Meas. Tech.PFKFB4 Assay
IC50 1400±n/a nM
Citation Martinsson, JFaernegardh, KJoensson, MRingom, R Bisarylsulfonamides useful in the treatment of inflammation and cancer US Patent US9718809 Publication Date 8/1/2017
 
6-phosphofructo-2-kinase/fructose-2,6-bisphosphatase 4
Name:6-phosphofructo-2-kinase/fructose-2,6-bisphosphatase 4
Type:Enzyme
Mol. Mass.:54039.68
Organism:Homo sapiens (Human)
Description:Q16877
Residue:469
BDBM267030
NameBDBM267030
Synonyms:Methyl 2-hydroxy-4-({[(2'-hydroxybiphenyl-4-yl)methyl]sulfonyl}amino)benzoate | US9718809, 126
TypeSmall organic molecule
Emp. Form.C21H19NO6S
Mol. Mass.413.444
SMILESCOC(=O)c1ccc(NS(=O)(=O)Cc2ccc(cc2)-c2ccccc2O)cc1O