Reaction Details
Target6-phosphofructo-2-kinase/fructose-2,6-bisphosphatase 4
LigandBDBM267035
Substrate/Competitorn/a
Meas. Tech.PFKFB4 Assay
IC50 1200±n/a nM
Citation Martinsson, JFaernegardh, KJoensson, MRingom, R Bisarylsulfonamides useful in the treatment of inflammation and cancer US Patent US9718809 Publication Date 8/1/2017
 
6-phosphofructo-2-kinase/fructose-2,6-bisphosphatase 4
Name:6-phosphofructo-2-kinase/fructose-2,6-bisphosphatase 4
Type:Enzyme
Mol. Mass.:54039.68
Organism:Homo sapiens (Human)
Description:Q16877
Residue:469
BDBM267035
NameBDBM267035
Synonyms:2-Methoxyethyl 4-({[5-chloro-4-(2-hydroxyphenyl)-2-thienyl]sulfonyl}amino)-2-hydroxybenzoate | US9718809, 133
TypeSmall organic molecule
Emp. Form.C20H18ClNO7S2
Mol. Mass.483.942
SMILESCOCCOC(=O)c1ccc(NS(=O)(=O)c2cc(c(Cl)s2)-c2ccccc2O)cc1O