Reaction Details
Target6-phosphofructo-2-kinase/fructose-2,6-bisphosphatase 4
LigandBDBM267055
Substrate/Competitorn/a
Meas. Tech.PFKFB4 Assay
IC50 700±n/a nM
Citation Martinsson, JFaernegardh, KJoensson, MRingom, R Bisarylsulfonamides useful in the treatment of inflammation and cancer US Patent US9718809 Publication Date 8/1/2017
 
6-phosphofructo-2-kinase/fructose-2,6-bisphosphatase 4
Name:6-phosphofructo-2-kinase/fructose-2,6-bisphosphatase 4
Type:Enzyme
Mol. Mass.:54039.68
Organism:Homo sapiens (Human)
Description:Q16877
Residue:469
BDBM267055
NameBDBM267055
Synonyms:2-Methoxyethyl 4-({[3-(2,3-dihydro-1-benzofuran-5-yl)phenyl]sulfonyl}amino)-2-hydroxybenzoate | US9718809, 175
TypeSmall organic molecule
Emp. Form.C24H23NO7S
Mol. Mass.469.507
SMILESCOCCOC(=O)c1ccc(NS(=O)(=O)c2cccc(c2)-c2ccc3OCCc3c2)cc1O