Reaction Details
Target6-phosphofructo-2-kinase/fructose-2,6-bisphosphatase 4
LigandBDBM267079
Substrate/Competitorn/a
Meas. Tech.PFKFB4 Assay
IC50 2400±n/a nM
Citation Martinsson, JFaernegardh, KJoensson, MRingom, R Bisarylsulfonamides useful in the treatment of inflammation and cancer US Patent US9718809 Publication Date 8/1/2017
 
6-phosphofructo-2-kinase/fructose-2,6-bisphosphatase 4
Name:6-phosphofructo-2-kinase/fructose-2,6-bisphosphatase 4
Type:Enzyme
Mol. Mass.:54039.68
Organism:Homo sapiens (Human)
Description:Q16877
Residue:469
BDBM267079
NameBDBM267079
Synonyms:Methyl 2-hydroxy-4-({[4'-(trifluoromethoxy)biphenyl-3-yl]sulfonyl}amino)benzoate | US9718809, 99
TypeSmall organic molecule
Emp. Form.C21H16F3NO6S
Mol. Mass.467.415
SMILESCOC(=O)c1ccc(NS(=O)(=O)c2cccc(c2)-c2ccc(OC(F)(F)F)cc2)cc1O