Reaction Details
TargetTranscription factor p65
LigandBDBM21625
Substrate/Competitorn/a
Meas. Tech.Name: High Throughput Screen to Identify Compounds that increase expression of NF-kB in Human Neuronal Cells - Dose Response
EC50 2322±n/a nM
Citation PubChem, PC Name: High Throughput Screen to Identify Compounds that increase expression of NF-kB in Human Neuronal Cells - Dose Response PubChem Bioassay(2008)[AID]
 
Transcription factor p65
Name:Transcription factor p65
Type:Enzyme
Mol. Mass.:60211.92
Organism:Homo sapiens (Human)
Description:Q04206
Residue:551
BDBM21625
NameBDBM21625
Synonyms:2-phenyl-5-(1H-pyrazol-3-yl)-1,3-thiazole Pyrazolylthiazole, 13
TypeSmall organic molecule
Emp. Form.C12H9N3S
Mol. Mass.227.285
SMILESc1cc(n[nH]1)-c1cnc(s1)-c1ccccc1