Reaction Details
TargetInduced myeloid leukemia cell differentiation protein Mcl-1
LigandBDBM50008
Substrate/Competitorn/a
Meas. Tech.Dose Response Confirmation for Mcl-1/Noxa Interaction Inhibitors
IC50 400±n/a nM
Citation PubChem, PC Dose Response Confirmation for Mcl-1/Noxa Interaction Inhibitors PubChem Bioassay(2008)[AID]
 
Induced myeloid leukemia cell differentiation protein Mcl-1
Name:Induced myeloid leukemia cell differentiation protein Mcl-1
Type:Membrane; Single-pass membrane protein
Mol. Mass.:37332.87
Organism:Homo sapiens (Human)
Description:Q07820
Residue:350
BDBM50008
NameBDBM50008
Synonyms:2-[[4-amino-5-[[4-(dimethylamino)anilino]-oxomethyl]-2-thiazolyl]thio]acetic acid ethyl ester MLS000079348 cid_659614 ethyl 2-[[4-azanyl-5-[[4-(dimethylamino)phenyl]carbamoyl]-1,3-thiazol-2-yl]sulfanyl]ethanoate
TypeSmall organic molecule
Emp. Form.C16H20N4O3S2
Mol. Mass.380.485
SMILESCCOC(=O)CSc1nc(N)c(s1)C(=O)Nc1ccc(cc1)N(C)C