Reaction Details
TargetInduced myeloid leukemia cell differentiation protein Mcl-1
LigandBDBM50028
Substrate/Competitorn/a
Meas. Tech.Dose Response Confirmation for Mcl-1/Noxa Interaction Inhibitors
IC50 433.417842±n/a nM
Citation PubChem, PC Dose Response Confirmation for Mcl-1/Noxa Interaction Inhibitors PubChem Bioassay(2008)[AID]
 
Induced myeloid leukemia cell differentiation protein Mcl-1
Name:Induced myeloid leukemia cell differentiation protein Mcl-1
Type:Membrane; Single-pass membrane protein
Mol. Mass.:37332.87
Organism:Homo sapiens (Human)
Description:Q07820
Residue:350
BDBM50028
NameBDBM50028
Synonyms:4-[2-[2-[butyl(ethyl)amino]ethylamino]-3,4-diketo-cyclobuten-1-yl]piperazine-1-carboxylic acid ethyl ester MLS000093371 cid_3235628 ethyl 4-[2-[2-[butyl(ethyl)amino]ethylamino]-3,4-bis(oxidanylidene)cyclobuten-1-yl]piperazine-1-carboxylate | ethyl 4-[2-[2-[butyl(ethyl)amino]ethylamino]-3,4-dioxocyclobuten-1-yl]piperazine-1-carboxylate
TypeSmall organic molecule
Emp. Form.C19H32N4O4
Mol. Mass.380.4818
SMILESCCCCN(CC)CCNc1c(N2CCN(CC2)C(=O)OCC)c(=O)c1=O