Reaction Details
TargetInduced myeloid leukemia cell differentiation protein Mcl-1
LigandBDBM50054
Substrate/Competitorn/a
Meas. Tech.Dose Response Confirmation for Mcl-1/Noxa Interaction Inhibitors
IC50 400±n/a nM
Citation PubChem, PC Dose Response Confirmation for Mcl-1/Noxa Interaction Inhibitors PubChem Bioassay(2008)[AID]
 
Induced myeloid leukemia cell differentiation protein Mcl-1
Name:Induced myeloid leukemia cell differentiation protein Mcl-1
Type:Membrane; Single-pass membrane protein
Mol. Mass.:37332.87
Organism:Homo sapiens (Human)
Description:Q07820
Residue:350
BDBM50054
NameBDBM50054
Synonyms:2-(2-furanyl)-3-(3-pyridinyl)-4-quinazolinone 2-(furan-2-yl)-3-pyridin-3-yl-quinazolin-4-one MLS000109772 cid_823064
TypeSmall organic molecule
Emp. Form.C17H11N3O2
Mol. Mass.289.2881
SMILESO=c1n(-c2cccnc2)c(nc2ccccc12)-c1ccco1