Reaction Details
TargetInduced myeloid leukemia cell differentiation protein Mcl-1
LigandBDBM44469
Substrate/Competitorn/a
Meas. Tech.Dose Response Confirmation for Mcl-1/Noxa Interaction Inhibitors
IC50 3161.786327±n/a nM
Citation PubChem, PC Dose Response Confirmation for Mcl-1/Noxa Interaction Inhibitors PubChem Bioassay(2008)[AID]
 
Induced myeloid leukemia cell differentiation protein Mcl-1
Name:Induced myeloid leukemia cell differentiation protein Mcl-1
Type:Membrane; Single-pass membrane protein
Mol. Mass.:37332.87
Organism:Homo sapiens (Human)
Description:Q07820
Residue:350
BDBM44469
NameBDBM44469
Synonyms:2,3-bis(2-furanyl)-N-(2-phenylethyl)-6-quinoxalinecarboxamide 2,3-bis(furan-2-yl)-N-(2-phenylethyl)quinoxaline-6-carboxamide SMR000131061 | cid_5076888
TypeSmall organic molecule
Emp. Form.C25H19N3O3
Mol. Mass.409.4367
SMILESO=C(NCCc1ccccc1)c1ccc2nc(-c3ccco3)c(nc2c1)-c1ccco1