Reaction Details
TargetInduced myeloid leukemia cell differentiation protein Mcl-1
LigandBDBM44504
Substrate/Competitorn/a
Meas. Tech.Dose Response Confirmation for Mcl-1/Noxa Interaction Inhibitors
IC50 751.608409±n/a nM
Citation PubChem, PC Dose Response Confirmation for Mcl-1/Noxa Interaction Inhibitors PubChem Bioassay(2008)[AID]
 
Induced myeloid leukemia cell differentiation protein Mcl-1
Name:Induced myeloid leukemia cell differentiation protein Mcl-1
Type:Membrane; Single-pass membrane protein
Mol. Mass.:37332.87
Organism:Homo sapiens (Human)
Description:Q07820
Residue:350
BDBM44504
NameBDBM44504
Synonyms:2-chloro-5-[5-[(E)-(5-cyano-2,6-diketo-4-methyl-3-pyridylidene)methyl]-2-furyl]benzoic acid ethyl ester MLS000519146 cid_6522725 ethyl 2-chloro-5-[5-[(E)-(5-cyano-4-methyl-2,6-dioxopyridin-3-ylidene)methyl]furan-2-yl]benzoate
TypeSmall organic molecule
Emp. Form.C21H15ClN2O5
Mol. Mass.410.807
SMILESCCOC(=O)c1cc(ccc1Cl)-c1ccc(\C=C2\C(=O)NC(=O)C(C#N)=C2C)o1