Reaction Details
TargetInduced myeloid leukemia cell differentiation protein Mcl-1
LigandBDBM50194
Substrate/Competitorn/a
Meas. Tech.Dose Response Confirmation for Mcl-1/Noxa Interaction Inhibitors
IC50 400±n/a nM
Citation PubChem, PC Dose Response Confirmation for Mcl-1/Noxa Interaction Inhibitors PubChem Bioassay(2008)[AID]
 
Induced myeloid leukemia cell differentiation protein Mcl-1
Name:Induced myeloid leukemia cell differentiation protein Mcl-1
Type:Membrane; Single-pass membrane protein
Mol. Mass.:37332.87
Organism:Homo sapiens (Human)
Description:Q07820
Residue:350
BDBM50194
NameBDBM50194
Synonyms:4-(4-Mercapto-8-methoxy-2-methyl-quinolin-3-yl)-butan-2-one 4-(8-methoxy-2-methyl-4-sulfanylidene-1H-quinolin-3-yl)butan-2-one MLS000590395 cid_868037
TypeSmall organic molecule
Emp. Form.C15H17NO2S
Mol. Mass.275.366
SMILESCOc1cccc2c(S)c(CCC(C)=O)c(C)nc12