Reaction Details
TargetInduced myeloid leukemia cell differentiation protein Mcl-1
LigandBDBM50296
Substrate/Competitorn/a
Meas. Tech.Dose Response Confirmation for Mcl-1/Noxa Interaction Inhibitors
IC50 400±n/a nM
Citation PubChem, PC Dose Response Confirmation for Mcl-1/Noxa Interaction Inhibitors PubChem Bioassay(2008)[AID]
 
Induced myeloid leukemia cell differentiation protein Mcl-1
Name:Induced myeloid leukemia cell differentiation protein Mcl-1
Type:Membrane; Single-pass membrane protein
Mol. Mass.:37332.87
Organism:Homo sapiens (Human)
Description:Q07820
Residue:350
BDBM50296
NameBDBM50296
Synonyms:2-[(4E)-2,5-diketo-4-[(5-methyl-2-furyl)methylene]imidazolidin-1-yl]-N-(m-tolyl)acetamide 2-[(4E)-4-[(5-methylfuran-2-yl)methylidene]-2,5-bis(oxidanylidene)imidazolidin-1-yl]-N-(3-methylphenyl)ethanamide 2-{(4E)-4-[(5-methyl-2-furyl)methylene]-2,5-dioxoimidazolidin-1-yl}-N-(3-methylphenyl)acetamide SMR000204179 | cid_15944782
TypeSmall organic molecule
Emp. Form.C18H17N3O4
Mol. Mass.339.3453
SMILESCc1ccc(\C=C2\NC(=O)N(CC(=O)Nc3cccc(C)c3)C2=O)o1