Reaction Details
TargetInduced myeloid leukemia cell differentiation protein Mcl-1
LigandBDBM32311
Substrate/Competitorn/a
Meas. Tech.Dose Response Confirmation for Mcl-1/Noxa Interaction Inhibitors
IC50 400±n/a nM
Citation PubChem, PC Dose Response Confirmation for Mcl-1/Noxa Interaction Inhibitors PubChem Bioassay(2008)[AID]
 
Induced myeloid leukemia cell differentiation protein Mcl-1
Name:Induced myeloid leukemia cell differentiation protein Mcl-1
Type:Membrane; Single-pass membrane protein
Mol. Mass.:37332.87
Organism:Homo sapiens (Human)
Description:Q07820
Residue:350
BDBM32311
NameBDBM32311
Synonyms:MLS000390291 cid_7125637
TypeSmall organic molecule
Emp. Form.C23H19N3O3S
Mol. Mass.417.48
SMILESNc1c(sc2nc3\C(CCc3c(-c3ccco3)c12)=C/c1ccco1)C(=O)NC1CC1