Reaction Details
TargetInduced myeloid leukemia cell differentiation protein Mcl-1
LigandBDBM50436
Substrate/Competitorn/a
Meas. Tech.Dose Response Confirmation for Mcl-1/Noxa Interaction Inhibitors
IC50 627.857427±n/a nM
Citation PubChem, PC Dose Response Confirmation for Mcl-1/Noxa Interaction Inhibitors PubChem Bioassay(2008)[AID]
 
Induced myeloid leukemia cell differentiation protein Mcl-1
Name:Induced myeloid leukemia cell differentiation protein Mcl-1
Type:Membrane; Single-pass membrane protein
Mol. Mass.:37332.87
Organism:Homo sapiens (Human)
Description:Q07820
Residue:350
BDBM50436
NameBDBM50436
Synonyms:3-ethyl-6-methoxy-2-methyl-1H-quinoline-4-thione SMR000281673 | cid_790792
TypeSmall organic molecule
Emp. Form.C13H15NOS
Mol. Mass.233.329
SMILESCCc1c(C)nc2ccc(OC)cc2c1S