Reaction Details
TargetInduced myeloid leukemia cell differentiation protein Mcl-1
LigandBDBM50556
Substrate/Competitorn/a
Meas. Tech.Dose Response Confirmation for Mcl-1/Noxa Interaction Inhibitors
IC50 400±n/a nM
Citation PubChem, PC Dose Response Confirmation for Mcl-1/Noxa Interaction Inhibitors PubChem Bioassay(2008)[AID]
 
Induced myeloid leukemia cell differentiation protein Mcl-1
Name:Induced myeloid leukemia cell differentiation protein Mcl-1
Type:Membrane; Single-pass membrane protein
Mol. Mass.:37332.87
Organism:Homo sapiens (Human)
Description:Q07820
Residue:350
BDBM50556
NameBDBM50556
Synonyms:4-[4-(2-thiophen-2-yl-4-quinazolinyl)-1-piperazinyl]phenol 4-[4-[2-(2-thienyl)quinazolin-4-yl]piperazino]phenol SMR000365148 | cid_2469096
TypeSmall organic molecule
Emp. Form.C22H20N4OS
Mol. Mass.388.485
SMILESOc1ccc(cc1)N1CCN(CC1)c1nc(nc2ccccc12)-c1cccs1