Reaction Details
TargetInduced myeloid leukemia cell differentiation protein Mcl-1
LigandBDBM50672
Substrate/Competitorn/a
Meas. Tech.Dose Response Confirmation for Mcl-1/Noxa Interaction Inhibitors
IC50 431.447442±n/a nM
Citation PubChem, PC Dose Response Confirmation for Mcl-1/Noxa Interaction Inhibitors PubChem Bioassay(2008)[AID]
 
Induced myeloid leukemia cell differentiation protein Mcl-1
Name:Induced myeloid leukemia cell differentiation protein Mcl-1
Type:Membrane; Single-pass membrane protein
Mol. Mass.:37332.87
Organism:Homo sapiens (Human)
Description:Q07820
Residue:350
BDBM50672
NameBDBM50672
Synonyms:3-[2-[1-(10H-phenothiazin-2-yl)ethylidene]hydrazinyl]benzoic acid MLS000775187 cid_4403483
TypeSmall organic molecule
Emp. Form.C21H17N3O2S
Mol. Mass.375.444
SMILESCC(N=Nc1cccc(c1)C(O)=O)c1ccc2Sc3ccccc3Nc2c1