Reaction Details
TargetDNA repair protein RAD51 homolog 1
LigandBDBM50055659
Substrate/Competitorn/a
Meas. Tech.Homologous Recombination_Rad51_DNA binding assay
IC50 46960±n/a nM
Citation PubChem, PC Homologous Recombination_Rad51_DNA binding assay PubChem Bioassay(2008)[AID]
 
DNA repair protein RAD51 homolog 1
Name:DNA repair protein RAD51 homolog 1
Type:Enzyme Catalytic Domain
Mol. Mass.:36960.74
Organism:Homo sapiens (Human)
Description:gi_49168602
Residue:339
BDBM50055659
NameBDBM50055659
Synonyms:2N-(3,3-aminoiminopropyl)-4-[4-(4-formamido-1-methyl-1H-2-pyrrolylcarboxamido)-1-methyl-1H-2-pyrrolylcarboxamido]-1-methyl-1H-2-pyrrolecarboxamide 2N-[5-(3-amino-3-iminopropylcarbamoyl)-1-methyl-1H-3-pyrrolyl]-4-(4-formamido-1-methyl-1H-2-pyrrolylcarboxamido)-1-methyl-1H-2-pyrrolecarboxamide(Distamycin) 4N-[5-(3-amino-3-iminopropylcarbamoyl)-1-methyl-1H-2-pyrrolyl]-2-(4-formamido-1-methyl-1H-2-pyrrolylcarboxamido)-1-methyl-1H-4-pyrrolecarboxamide CHEMBL101290 DISTAMYCIN cid_6602691
TypeSmall organic molecule
Emp. Form.C22H27N9O4
Mol. Mass.481.5077
SMILESCn1cc(NC=O)cc1C(=O)Nc1cc(C(=O)Nc2cc(C(=O)NCCC(N)=N)n(C)c2)n(C)c1