Reaction Details
TargetDNA repair protein RAD51 homolog 1
LigandBDBM43854
Substrate/Competitorn/a
Meas. Tech.Homologous recombination_Rad 51_dose response_2
IC50 53000±n/a nM
Citation PubChem, PC Homologous recombination_Rad 51_dose response_2 PubChem Bioassay(2008)[AID]
 
DNA repair protein RAD51 homolog 1
Name:DNA repair protein RAD51 homolog 1
Type:Enzyme Catalytic Domain
Mol. Mass.:36960.74
Organism:Homo sapiens (Human)
Description:gi_49168602
Residue:339
BDBM43854
NameBDBM43854
Synonyms:2-[(veratroylhydrazono)methyl]benzoic acid 2-[[(3,4-dimethoxyphenyl)carbonylhydrazinylidene]methyl]benzoic acid MLS000774113 SMR000365110 | cid_958176
TypeSmall organic molecule
Emp. Form.C17H16N2O5
Mol. Mass.328.3193
SMILESCOc1ccc(cc1OC)C(=O)NN=Cc1ccccc1C(O)=O