Reaction Details
TargetE3 ubiquitin-protein ligase Mdm2
LigandBDBM43362
Substrate/Competitorn/a
Meas. Tech.E3 Ligase_Mutant_Dose Response
EC50 80±n/a nM
Citation PubChem, PC E3 Ligase_Mutant_Dose Response PubChem Bioassay(2008)[AID]
 
E3 ubiquitin-protein ligase Mdm2
Name:E3 ubiquitin-protein ligase Mdm2
Type:Oncoprotein
Mol. Mass.:55196.54
Organism:Homo sapiens (Human)
Description:Q00987
Residue:491
BDBM43362
NameBDBM43362
Synonyms:MLS000069752 N,N-dimethylcarbamodithioic acid [[dimethylamino(sulfanylidene)methyl]thio] ester TETRAMETHYLTHIURAM DISULFIDE dimethylcarbamothioylsulfanyl N,N-dimethylcarbamodithioate
TypeSmall organic molecule
Emp. Form.C6H12N2S4
Mol. Mass.240.433
SMILESCN(C)C(=S)SSC(=S)N(C)C