Reaction Details
TargetE3 ubiquitin-protein ligase Mdm2
LigandBDBM36838
Substrate/Competitorn/a
Meas. Tech.E3 Ligase_WT_Dose Response
EC50 3040±n/a nM
Citation PubChem, PC E3 Ligase_WT_Dose Response PubChem Bioassay(2008)[AID]
 
E3 ubiquitin-protein ligase Mdm2
Name:E3 ubiquitin-protein ligase Mdm2
Type:Oncoprotein
Mol. Mass.:55196.54
Organism:Homo sapiens (Human)
Description:Q00987
Residue:491
BDBM36838
NameBDBM36838
Synonyms:1-ethenylsulfonyl-4-(4-ethenylsulfonylphenoxy)benzene MLS000070497 cid_647878
TypeSmall organic molecule
Emp. Form.C16H14O5S2
Mol. Mass.350.409
SMILESC=CS(=O)(=O)c1ccc(Oc2ccc(cc2)S(=O)(=O)C=C)cc1