Reaction Details
TargetE3 ubiquitin-protein ligase Mdm2
LigandBDBM43428
Substrate/Competitorn/a
Meas. Tech.E3 Ligase_WT_Dose Response
EC50 40±n/a nM
Citation PubChem, PC E3 Ligase_WT_Dose Response PubChem Bioassay(2008)[AID]
 
E3 ubiquitin-protein ligase Mdm2
Name:E3 ubiquitin-protein ligase Mdm2
Type:Oncoprotein
Mol. Mass.:55196.54
Organism:Homo sapiens (Human)
Description:Q00987
Residue:491
BDBM43428
NameBDBM43428
Synonyms:3-[(4-isopropylphenoxy)methyl]-N'-(3-pyridinylmethylene)benzohydrazide 3-[(4-propan-2-ylphenoxy)methyl]-N-(3-pyridinylmethylideneamino)benzamide MLS000698222 cid_1229743
TypeSmall organic molecule
Emp. Form.C23H23N3O2
Mol. Mass.373.4476
SMILESCC(C)c1ccc(OCc2cccc(c2)C(=O)NN=Cc2cccnc2)cc1