Reaction Details
TargetdTDP-4-dehydrorhamnose 3,5-epimerase
LigandBDBM50022178
Substrate/Competitorn/a
Meas. Tech.Rml C and D dose-response confirmation
IC50 999±n/a nM
Citation PubChem, PC Rml C and D dose-response confirmation PubChem Bioassay(2009)[AID]
 
dTDP-4-dehydrorhamnose 3,5-epimerase
Name:dTDP-4-dehydrorhamnose 3,5-epimerase
Type:Enzyme Catalytic Domain
Mol. Mass.:22306.68
Organism:Mycobacterium tuberculosis H37Rv
Description:gi_15610601
Residue:202
BDBM50022178
NameBDBM50022178
Synonyms:4-Methyl-7-hydroxycoumarin 7-Hydroxy-4-methyl-2-oxo-2H-1-benzopyran 7-Hydroxy-4-methyl-2H-1-benzopyran-2-one 7-Hydroxy-4-methylcoumarin CHEMBL12208 Imecromone cid_5280567
TypeSmall organic molecule
Emp. Form.C10H8O3
Mol. Mass.176.1687
SMILESCc1cc(=O)oc2cc(O)ccc12