Reaction Details
TargetRegulator of G-protein signaling 4
LigandBDBM47703
Substrate/Competitorn/a
Meas. Tech.Dose response, multiplexed high-throughput screen for small molecule regulators of RGS family protein interactions, specifically RGS4-Galphao.
EC50 30000±n/a nM
Citation PubChem, PC Dose response, multiplexed high-throughput screen for small molecule regulators of RGS family protein interactions, specifically RGS4-Galphao. PubChem Bioassay(2009)[AID]
 
Regulator of G-protein signaling 4
Name:Regulator of G-protein signaling 4
Type:Enzyme
Mol. Mass.:23263.51
Organism:Homo sapiens (Human)
Description:P49798
Residue:205
BDBM47703
NameBDBM47703
Synonyms:2,3-dihydro-1,4-dioxin-5-carboxylic acid [2-(4-tert-butylanilino)-2-oxoethyl] ester MLS000082235 [2-(4-tert-butylanilino)-2-oxoethyl] 2,3-dihydro-1,4-dioxine-5-carboxylate cid_2337962
TypeSmall organic molecule
Emp. Form.C17H21NO5
Mol. Mass.319.3523
SMILESCC(C)(C)c1ccc(NC(=O)COC(=O)C2=COCCO2)cc1