Reaction Details
TargetRegulator of G-protein signaling 4
LigandBDBM47709
Substrate/Competitorn/a
Meas. Tech.Dose response, multiplexed high-throughput screen for small molecule regulators of RGS family protein interactions, specifically RGS4-Galphao.
EC50 60±n/a nM
Citation PubChem, PC Dose response, multiplexed high-throughput screen for small molecule regulators of RGS family protein interactions, specifically RGS4-Galphao. PubChem Bioassay(2009)[AID]
 
Regulator of G-protein signaling 4
Name:Regulator of G-protein signaling 4
Type:Enzyme
Mol. Mass.:23263.51
Organism:Homo sapiens (Human)
Description:P49798
Residue:205
BDBM47709
NameBDBM47709
Synonyms:9-(2-thienyl)-5,6,7,9-tetrahydro-1H-[1,2,4]triazolo[5,1-b]quinazolin-8-one 9-thiophen-2-yl-5,6,7,9-tetrahydro-1H-[1,2,4]triazolo[5,1-b]quinazolin-8-one SMR000073127 | cid_5711559
TypeSmall organic molecule
Emp. Form.C13H12N4OS
Mol. Mass.272.326
SMILESO=C1CCCC2=Nc3ncnn3C(C12)c1cccs1