Reaction Details
TargetRegulator of G-protein signaling 4
LigandBDBM47715
Substrate/Competitorn/a
Meas. Tech.Dose response, multiplexed high-throughput screen for small molecule regulators of RGS family protein interactions, specifically RGS4-Galphao.
EC50 1570±n/a nM
Citation PubChem, PC Dose response, multiplexed high-throughput screen for small molecule regulators of RGS family protein interactions, specifically RGS4-Galphao. PubChem Bioassay(2009)[AID]
 
Regulator of G-protein signaling 4
Name:Regulator of G-protein signaling 4
Type:Enzyme
Mol. Mass.:23263.51
Organism:Homo sapiens (Human)
Description:P49798
Residue:205
BDBM47715
NameBDBM47715
Synonyms:DEFEROXAMINE MLS000028713 N-[5-[[4-[5-[acetyl(hydroxy)amino]pentylamino]-1,4-dioxobutyl]-hydroxyamino]pentyl]-N''-(5-aminopentyl)-N''-hydroxybutanediamide;methanesulfonic acid N-[5-[[4-[5-[acetyl(hydroxy)amino]pentylamino]-4-oxobutanoyl]-hydroxyamino]pentyl]-N''-(5-aminopentyl)-N''-hydroxybutanediamide;methanesulfonic acid cid_62881
TypeSmall organic molecule
Emp. Form.C25H48N6O8
Mol. Mass.560.684
SMILESCC(=O)N(O)CCCCCNC(=O)CCC(=O)N(O)CCCCCNC(=O)CCC(=O)N(O)CCCCCN