Reaction Details
TargetRegulator of G-protein signaling 4
LigandBDBM33066
Substrate/Competitorn/a
Meas. Tech.Dose response, multiplexed high-throughput screen for small molecule regulators of RGS family protein interactions, specifically RGS4-Galphao.
EC50 2300±n/a nM
Citation PubChem, PC Dose response, multiplexed high-throughput screen for small molecule regulators of RGS family protein interactions, specifically RGS4-Galphao. PubChem Bioassay(2009)[AID]
 
Regulator of G-protein signaling 4
Name:Regulator of G-protein signaling 4
Type:Enzyme
Mol. Mass.:23263.51
Organism:Homo sapiens (Human)
Description:P49798
Residue:205
BDBM33066
NameBDBM33066
Synonyms:2,5-bis(chloranyl)-3-[2-(dimethylamino)-1,3-thiazol-5-yl]-6-pyrrolidin-1-yl-cyclohexa-2,5-diene-1,4-dione 2,5-dichloro-3-[2-(dimethylamino)-1,3-thiazol-5-yl]-6-pyrrolidin-1-ylcyclohexa-2,5-diene-1,4-dione 2,5-dichloro-3-[2-(dimethylamino)thiazol-5-yl]-6-pyrrolidino-p-benzoquinone SMR000115102 | cid_1002248
TypeSmall organic molecule
Emp. Form.C15H15Cl2N3O2S
Mol. Mass.372.27
SMILESCN(C)c1ncc(s1)C1=C(Cl)C(=O)C(N2CCCC2)=C(Cl)C1=O