Reaction Details
TargetRegulator of G-protein signaling 4
LigandBDBM46608
Substrate/Competitorn/a
Meas. Tech.Dose response, multiplexed high-throughput screen for small molecule regulators of RGS family protein interactions, specifically RGS4-Galphao.
EC50 30000±n/a nM
Citation PubChem, PC Dose response, multiplexed high-throughput screen for small molecule regulators of RGS family protein interactions, specifically RGS4-Galphao. PubChem Bioassay(2009)[AID]
 
Regulator of G-protein signaling 4
Name:Regulator of G-protein signaling 4
Type:Enzyme
Mol. Mass.:23263.51
Organism:Homo sapiens (Human)
Description:P49798
Residue:205
BDBM46608
NameBDBM46608
Synonyms:(4E)-5-methyl-4-[(3-nitroanilino)methylene]-2-phenyl-2-pyrazoline-3-thione (4E)-5-methyl-4-[(3-nitroanilino)methylidene]-2-phenylpyrazole-3-thione (4Z)-5-methyl-4-[(3-nitroanilino)methylene]-2-phenyl-2-pyrazoline-3-thione cid_6945186
TypeSmall organic molecule
Emp. Form.C17H14N4O2S
Mol. Mass.338.384
SMILESCc1[n-]n(-c2ccccc2)c(=S)c1\C=[NH+]\c1cccc(c1)[N+]([O-])=O