Reaction Details
TargetDual specificity protein phosphatase 3
LigandBDBM46223
Substrate/Competitorn/a
Meas. Tech.Fluorescent assay for identification of compounds that inhibit VHR1
IC50 3340±n/a nM
Citation PubChem, PC Fluorescent assay for identification of compounds that inhibit VHR1 PubChem Bioassay(2009)[AID]
 
Dual specificity protein phosphatase 3
Name:Dual specificity protein phosphatase 3
Type:Hydrolase
Mol. Mass.:20480.58
Organism:Homo sapiens (Human)
Description:n/a
Residue:185
BDBM46223
NameBDBM46223
Synonyms:(4Z)-2-methoxy-4-[piperidin-1-yl(sulfanyl)methylidene]cyclohexa-2,5-dien-1-one (4Z)-4-[mercapto(piperidino)methylene]-2-methoxy-cyclohexa-2,5-dien-1-one cid_5336454
TypeSmall organic molecule
Emp. Form.C13H17NO2S
Mol. Mass.251.345
SMILESCOc1cc(ccc1O)C(=S)N1CCCCC1