Reaction Details
TargetMitogen-activated protein kinase kinase kinase kinase 2
LigandBDBM51854
Substrate/Competitorn/a
Meas. Tech.Dose Response Confirmation via Multiplex HTS Assay for Inhibitors of MEK Kinase PB1 Domains, specifically MEK5 binding to MEK Kinase 2 Wildtype
EC50 3130±n/a nM
Citation PubChem, PC Dose Response Confirmation via Multiplex HTS Assay for Inhibitors of MEK Kinase PB1 Domains, specifically MEK5 binding to MEK Kinase 2 Wildtype PubChem Bioassay(2009)[AID]
 
Mitogen-activated protein kinase kinase kinase kinase 2
Name:Mitogen-activated protein kinase kinase kinase kinase 2
Type:n/a
Mol. Mass.:91551.35
Organism:Homo sapiens (Human)
Description:n/a
Residue:820
BDBM51854
NameBDBM51854
Synonyms:MLS001004803 [amino-[[3-(4-bromophenyl)-1-phenyl-4-pyrazolyl]methylthio]methylidene]ammonium;chloride [amino-[[3-(4-bromophenyl)-1-phenylpyrazol-4-yl]methylsulfanyl]methylidene]azanium;chloride cid_16196089
TypeSmall organic molecule
Emp. Form.C17H16BrN4S
Mol. Mass.388.304
SMILESNC(=[NH2+])SCc1cn(nc1-c1ccc(Br)cc1)-c1ccccc1