Reaction Details
TargetMitogen-activated protein kinase kinase kinase kinase 2
LigandBDBM51855
Substrate/Competitorn/a
Meas. Tech.Dose Response Confirmation via Multiplex HTS Assay for Inhibitors of MEK Kinase PB1 Domains, specifically MEK5 binding to MEK Kinase 2 Wildtype
EC50 5940±n/a nM
Citation PubChem, PC Dose Response Confirmation via Multiplex HTS Assay for Inhibitors of MEK Kinase PB1 Domains, specifically MEK5 binding to MEK Kinase 2 Wildtype PubChem Bioassay(2009)[AID]
 
Mitogen-activated protein kinase kinase kinase kinase 2
Name:Mitogen-activated protein kinase kinase kinase kinase 2
Type:n/a
Mol. Mass.:91551.35
Organism:Homo sapiens (Human)
Description:n/a
Residue:820
BDBM51855
NameBDBM51855
Synonyms:MLS001017289 N-[4-[2-(diethylamino)ethylcarbamoyl]phenyl]-1-phenyl-3-thiophen-2-yl-pyrazole-4-carboxamide N-[4-[[2-(diethylamino)ethylamino]-oxomethyl]phenyl]-1-phenyl-3-thiophen-2-yl-4-pyrazolecarboxamide cid_2329736
TypeSmall organic molecule
Emp. Form.C27H29N5O2S
Mol. Mass.487.616
SMILESCCN(CC)CCNC(=O)c1ccc(NC(=O)c2cn(nc2-c2cccs2)-c2ccccc2)cc1