Reaction Details
TargetMitogen-activated protein kinase kinase kinase kinase 2
LigandBDBM51877
Substrate/Competitorn/a
Meas. Tech.Dose Response Confirmation via Multiplex HTS Assay for Inhibitors of MEK Kinase PB1 Domains, specifically MEK5 binding to MEK Kinase 2 Wildtype
EC50 4350±n/a nM
Citation PubChem, PC Dose Response Confirmation via Multiplex HTS Assay for Inhibitors of MEK Kinase PB1 Domains, specifically MEK5 binding to MEK Kinase 2 Wildtype PubChem Bioassay(2009)[AID]
 
Mitogen-activated protein kinase kinase kinase kinase 2
Name:Mitogen-activated protein kinase kinase kinase kinase 2
Type:n/a
Mol. Mass.:91551.35
Organism:Homo sapiens (Human)
Description:n/a
Residue:820
BDBM51877
NameBDBM51877
Synonyms:3-[[5-tert-butyl-3-(4-chlorophenyl)pyrazolo[1,5-a]pyrimidin-7-yl]amino]propyl-dimethyl-amine N'-[5-tert-Butyl-3-(4-chloro-phenyl)-pyrazolo[1,5-a]pyrimidin-7-yl]-N,N-dimethyl-propane-1,3-diamine N-[5-tert-butyl-3-(4-chlorophenyl)pyrazolo[1,5-a]pyrimidin-7-yl]-N',N'-dimethyl-propane-1,3-diamine SMR000439716 | cid_2035190
TypeSmall organic molecule
Emp. Form.C21H28ClN5
Mol. Mass.385.934
SMILESCN(C)CCCNc1cc(nc2c(cnn12)-c1ccc(Cl)cc1)C(C)(C)C