Reaction Details
TargetMitogen-activated protein kinase kinase kinase kinase 2
LigandBDBM51882
Substrate/Competitorn/a
Meas. Tech.Dose Response Confirmation via Multiplex HTS Assay for Inhibitors of MEK Kinase PB1 Domains, specifically MEK5 binding to MEK Kinase 2 Wildtype
EC50 30000±n/a nM
Citation PubChem, PC Dose Response Confirmation via Multiplex HTS Assay for Inhibitors of MEK Kinase PB1 Domains, specifically MEK5 binding to MEK Kinase 2 Wildtype PubChem Bioassay(2009)[AID]
 
Mitogen-activated protein kinase kinase kinase kinase 2
Name:Mitogen-activated protein kinase kinase kinase kinase 2
Type:n/a
Mol. Mass.:91551.35
Organism:Homo sapiens (Human)
Description:n/a
Residue:820
BDBM51882
NameBDBM51882
Synonyms:2-(diethylamino)ethyl 4-[[(Z)-2-cyano-2-[4-(3,4-dimethoxyphenyl)-1,3-thiazol-2-yl]ethenyl]amino]benzoate 4-[[(Z)-2-cyano-2-[4-(3,4-dimethoxyphenyl)thiazol-2-yl]vinyl]amino]benzoic acid 2-(diethylamino)ethyl ester MLS000769345 cid_16682517
TypeSmall organic molecule
Emp. Form.C27H30N4O4S
Mol. Mass.506.617
SMILESCCN(CC)CCOC(=O)c1ccc(cc1)N=CC(C#N)c1nc(cs1)-c1ccc(OC)c(OC)c1