Reaction Details
TargetBeta-lactamase
LigandBDBM51998
Substrate/Competitorn/a
Meas. Tech.Epi-absorbance-based dose response biochemical high throughput screening assay for selective inhibitors of VIM-2 metallo-beta-lactamase
IC50 1004±n/a nM
Citation PubChem, PC Epi-absorbance-based dose response biochemical high throughput screening assay for selective inhibitors of VIM-2 metallo-beta-lactamase PubChem Bioassay(2009)[AID]
 
Beta-lactamase
Name:Beta-lactamase
Synonyms:Beta lactamase
Type:Enzyme Catalytic Domain
Mol. Mass.:31513.38
Organism:Pseudomonas aeruginosa
Description:gi_114881106
Residue:286
BDBM51998
NameBDBM51998
TypeSmall organic molecule
Emp. Form.C16H22N4O2S2
Mol. Mass.366.501
SMILESCN(C)S(=O)(=O)c1cccc(NC(=S)NN=CC2CCC=CC2)c1