Reaction Details
TargetBeta-lactamase
LigandBDBM52008
Substrate/Competitorn/a
Meas. Tech.Epi-absorbance-based dose response biochemical high throughput screening assay for selective inhibitors of VIM-2 metallo-beta-lactamase
IC50 1293±n/a nM
Citation PubChem, PC Epi-absorbance-based dose response biochemical high throughput screening assay for selective inhibitors of VIM-2 metallo-beta-lactamase PubChem Bioassay(2009)[AID]
 
Beta-lactamase
Name:Beta-lactamase
Synonyms:Beta lactamase
Type:Enzyme Catalytic Domain
Mol. Mass.:31513.38
Organism:Pseudomonas aeruginosa
Description:gi_114881106
Residue:286
BDBM52008
NameBDBM52008
TypeSmall organic molecule
Emp. Form.C19H13ClN2O4
Mol. Mass.368.771
SMILESOC(=O)c1[nH]c2ccc(Cl)cc2c1CCN1C(=O)c2ccccc2C1=O