Reaction Details
TargetBeta-lactamase
LigandBDBM52014
Substrate/Competitorn/a
Meas. Tech.Epi-absorbance-based dose response biochemical high throughput screening assay for selective inhibitors of VIM-2 metallo-beta-lactamase
IC50 1229±n/a nM
Citation PubChem, PC Epi-absorbance-based dose response biochemical high throughput screening assay for selective inhibitors of VIM-2 metallo-beta-lactamase PubChem Bioassay(2009)[AID]
 
Beta-lactamase
Name:Beta-lactamase
Synonyms:Beta lactamase
Type:Enzyme Catalytic Domain
Mol. Mass.:31513.38
Organism:Pseudomonas aeruginosa
Description:gi_114881106
Residue:286
BDBM52014
NameBDBM52014
TypeSmall organic molecule
Emp. Form.C14H16N4S
Mol. Mass.272.369
SMILESCCc1n[nH]c(=S)n1N=CC(C)=Cc1ccccc1