Reaction Details
TargetBeta-lactamase
LigandBDBM52009
Substrate/Competitorn/a
Meas. Tech.FRET-based counterscreen for selective VIM-2 inhibitors: dose response biochemical high throughput screening assay to identify epi-absorbance assay artifacts.
IC50 716±n/a nM
Citation PubChem, PC FRET-based counterscreen for selective VIM-2 inhibitors: dose response biochemical high throughput screening assay to identify epi-absorbance assay artifacts. PubChem Bioassay(2009)[AID]
 
Beta-lactamase
Name:Beta-lactamase
Synonyms:Beta lactamase
Type:Enzyme Catalytic Domain
Mol. Mass.:31513.38
Organism:Pseudomonas aeruginosa
Description:gi_114881106
Residue:286
BDBM52009
NameBDBM52009
TypeSmall organic molecule
Emp. Form.C19H12BrN3O6
Mol. Mass.458.219
SMILESOC(=O)c1[nH]c2ccc(Br)cc2c1CCN1C(=O)c2cccc(c2C1=O)[N+]([O-])=O