Reaction Details
TargetBeta-lactamase
LigandBDBM52020
Substrate/Competitorn/a
Meas. Tech.FRET-based counterscreen for selective VIM-2 inhibitors: dose response biochemical high throughput screening assay to identify epi-absorbance assay artifacts.
IC50 1538±n/a nM
Citation PubChem, PC FRET-based counterscreen for selective VIM-2 inhibitors: dose response biochemical high throughput screening assay to identify epi-absorbance assay artifacts. PubChem Bioassay(2009)[AID]
 
Beta-lactamase
Name:Beta-lactamase
Synonyms:Beta lactamase
Type:Enzyme Catalytic Domain
Mol. Mass.:31513.38
Organism:Pseudomonas aeruginosa
Description:gi_114881106
Residue:286
BDBM52020
NameBDBM52020
TypeSmall organic molecule
Emp. Form.C21H25NO7
Mol. Mass.403.4257
SMILESC[C@H](NC(=O)COc1cc2OC(C)(C)CCc2c2oc(=O)c(C)c(C)c12)C(O)=O