Reaction Details
TargetZinc finger protein mex-5
LigandBDBM32274
Substrate/Competitorn/a
Meas. Tech.Fluorescent Polarization Homogeneous Dose Response HTS to Indentify Inhibitors of Mex-5 Binding to TCR-2
EC50 4179±n/a nM
Citation PubChem, PC Fluorescent Polarization Homogeneous Dose Response HTS to Indentify Inhibitors of Mex-5 Binding to TCR-2 PubChem Bioassay(2009)[AID]
 
Zinc finger protein mex-5
Name:Zinc finger protein mex-5
Type:Enzyme Catalytic Domain
Mol. Mass.:52832.78
Organism:Caenorhabditis elegans
Description:gi_55976631
Residue:468
BDBM32274
NameBDBM32274
Synonyms:2,5-bis(chloranyl)-3-(4-methylpiperazin-1-yl)-6-(2-piperidin-1-yl-1,3-thiazol-5-yl)cyclohexa-2,5-diene-1,4-dione 2,5-dichloro-3-(4-methyl-1-piperazinyl)-6-[2-(1-piperidinyl)-5-thiazolyl]cyclohexa-2,5-diene-1,4-dione 2,5-dichloro-3-(4-methylpiperazino)-6-(2-piperidinothiazol-5-yl)-p-benzoquinone SMR000115103 | cid_1002249
TypeSmall organic molecule
Emp. Form.C19H22Cl2N4O2S
Mol. Mass.441.375
SMILESCN1CCN(CC1)C1=C(Cl)C(=O)C(c2cnc(s2)N2CCCCC2)=C(Cl)C1=O