Reaction Details
TargetZinc finger protein mex-5
LigandBDBM52473
Substrate/Competitorn/a
Meas. Tech.Fluorescent Polarization Homogeneous Dose Response HTS to Indentify Inhibitors of Mex-5 Binding to TCR-2
EC50 300000±n/a nM
Citation PubChem, PC Fluorescent Polarization Homogeneous Dose Response HTS to Indentify Inhibitors of Mex-5 Binding to TCR-2 PubChem Bioassay(2009)[AID]
 
Zinc finger protein mex-5
Name:Zinc finger protein mex-5
Type:Enzyme Catalytic Domain
Mol. Mass.:52832.78
Organism:Caenorhabditis elegans
Description:gi_55976631
Residue:468
BDBM52473
NameBDBM52473
Synonyms:4-(2,5-dimethyl-1-pyrrolyl)benzoic acid [2-(methylcarbamoylamino)-2-oxoethyl] ester MLS000334093 [2-(methylcarbamoylamino)-2-oxidanylidene-ethyl] 4-(2,5-dimethylpyrrol-1-yl)benzoate cid_2496156
TypeSmall organic molecule
Emp. Form.C17H19N3O4
Mol. Mass.329.3505
SMILESCNC(=O)NC(=O)COC(=O)c1ccc(cc1)-n1c(C)ccc1C